W(CO)3

Gas phase thermochemistry data

Data compiled by: José A. Martinho Simões

Quantity Value Units Method Reference Comment
Δfgas-21. ± 10.kcal/molReviewMartinho SimõesThe enthalpy of formation of W(CO)3 relies on -211.3 ± 0.65 kcal/mol for the enthalpy of formation of W(CO)6(g)

Reaction thermochemistry data

Data compiled by: José A. Martinho Simões

Individual Reactions

C4O4W (g) = C3O3W (g) + Carbon monoxide (g)

By formula: C4O4W (g) = C3O3W (g) + CO (g)

Quantity Value Units Method Reference Comment
Δr>33.0kcal/molKinGRayner, Ishikawa, et al., 1991
Δr25. ± 15.kcal/molMBPSVenkataraman, Hou, et al., 1990

Tungsten hexacarbonyl (g) = C3O3W (g) + 3Carbon monoxide (g)

By formula: C6O6W (g) = C3O3W (g) + 3CO (g)

Quantity Value Units Method Reference Comment
Δr111. ± 10.kcal/molMBPSVenkataraman, Hou, et al., 1990

References

Martinho Simões
Martinho Simões, J.A., Private communication (see http://webbook.nist.gov/chemistry/om/). [all data]

Rayner, Ishikawa, et al., 1991
Rayner, D.M.; Ishikawa, Y.; Brown, C.E.; Hackett, P.A., J. Chem. Phys., 1991, 94, 5471. [all data]

Venkataraman, Hou, et al., 1990
Venkataraman, B.; Hou, H.; Zhang, Z.; Chen, S.; Bandukwalla, G.; Vernon, M., J. Chem. Phys., 1990, 92, 5338. [all data]