W(CO)5(n-C7H16)

Reaction thermochemistry data

Data compiled by: José A. Martinho Simões

Individual Reactions

C12H16O5W (solution) = C5O5W (solution) + Heptane (solution)

By formula: C12H16O5W (solution) = C5O5W (solution) + C7H16 (solution)

Quantity Value Units Method Reference Comment
Δr56.1kJ/molN/AMorse, Parker, et al., 1989solvent: Heptane; The reaction enthalpy was derived by using the LPHP value for the enthalpy of cleavage of W-CO bond in W(CO)6, 192.5 kJ/mol Lewis, Golden, et al., 1984, toghether with a PAC value for the reaction W(CO)6(solution) + n-C7H16(solution) = W(CO)5(n-C7H16)(solution) + CO(solution), 136.4 kJ/mol Morse, Parker, et al., 1989

Tungsten hexacarbonyl (solution) + Heptane (solution) = C12H16O5W (solution) + Carbon monoxide (solution)

By formula: C6O6W (solution) + C7H16 (solution) = C12H16O5W (solution) + CO (solution)

Quantity Value Units Method Reference Comment
Δr136.4 ± 1.7kJ/molPACMorse, Parker, et al., 1989solvent: Heptane; The reaction enthalpy relies on 0.72 for the quantum yield of CO dissociation

References

Morse, Parker, et al., 1989
Morse, J.M., Jr.; Parker, G.H.; Burkey, T.J., Organometallics, 1989, 8, 2471. [all data]

Lewis, Golden, et al., 1984
Lewis, K.E.; Golden, D.M.; Smith, G.P., Organometallic bond dissociation energies: Laser pyrolysis of Fe(CO)5, Cr(CO)6, Mo(CO)6, and W(CO)6, J. Am. Chem. Soc., 1984, 106, 3905. [all data]