W(Cp)2(SEt)2

Gas phase thermochemistry data

Data compiled by: José A. Martinho Simões

Quantity Value Units Method Reference Comment
Δfgas38.9 ± 3.2kcal/molReviewMartinho SimõesThe enthalpy of formation relies on -15.1 ± 1.7 kcal/mol for the enthalpy of formation of W(Cp)2(Cl)2(cr)

Condensed phase thermochemistry data

Data compiled by: José A. Martinho Simões

Quantity Value Units Method Reference Comment
Δfsolid16.9 ± 2.1kcal/molReviewMartinho SimõesThe enthalpy of formation relies on -15.1 ± 1.7 kcal/mol for the enthalpy of formation of W(Cp)2(Cl)2(cr)

Phase change data

Data compiled by: José A. Martinho Simões

Quantity Value Units Method Reference Comment
Δsub22. ± 2.4kcal/molRSCCalhorda, Carrondo, et al., 1988

References

Martinho Simões
Martinho Simões, J.A., Private communication (see http://webbook.nist.gov/chemistry/om/). [all data]

Calhorda, Carrondo, et al., 1988
Calhorda, M.J.; Carrondo, M.A.A.F. de C.T.; Dias, A.R.; Frazão, C.F.; Hursthouse, M.B.; Martinho Simões, J.A.; Teixeira, C., Inorg. Chem., 1988, 27, 2513. [all data]