Mo2(O-i-Pr)8

Gas phase thermochemistry data

Data compiled by: José A. Martinho Simões

Quantity Value Units Method Reference Comment
Δfgas-2157. ± 18.kJ/molReviewMartinho Simões

Condensed phase thermochemistry data

Data compiled by: José A. Martinho Simões

Quantity Value Units Method Reference Comment
Δfsolid-2294.3 ± 9.0kJ/molReviewMartinho Simões

Phase change data

Data compiled by: José A. Martinho Simões

Quantity Value Units Method Reference Comment
Δsub137. ± 15.kJ/molRSCCavell, Connor, et al., 1981

References

Martinho Simões
Martinho Simões, J.A., Private communication (see http://webbook.nist.gov/chemistry/om/). [all data]

Cavell, Connor, et al., 1981
Cavell, K.J.; Connor, J.A.; Pilcher, G.; Ribeiro da Silva, M.A.V.; Ribiero da Silva, D.M.C.; Vipmani, Y.; Zafarani-Moattar, M.T., J. Chem. Soc. Faraday Trans. 1, 1981, 77, 1585. [all data]