Mo2(O-i-Pr)6

Gas phase thermochemistry data

Data compiled by: José A. Martinho Simões

Quantity Value Units Method Reference Comment
Δfgas-1550. ± 13.kJ/molReviewMartinho Simões

Condensed phase thermochemistry data

Data compiled by: José A. Martinho Simões

Quantity Value Units Method Reference Comment
Δfsolid-1663.3 ± 8.9kJ/molReviewMartinho Simões

Phase change data

Data compiled by: José A. Martinho Simões

Quantity Value Units Method Reference Comment
Δsub113. ± 10.kJ/molRSCCavell, Connor, et al., 1981

References

Martinho Simões
Martinho Simões, J.A., Private communication (see http://webbook.nist.gov/chemistry/om/). [all data]

Cavell, Connor, et al., 1981
Cavell, K.J.; Connor, J.A.; Pilcher, G.; Ribeiro da Silva, M.A.V.; Ribiero da Silva, D.M.C.; Vipmani, Y.; Zafarani-Moattar, M.T., J. Chem. Soc. Faraday Trans. 1, 1981, 77, 1585. [all data]