Mo(CO)3(PCy3)2(py)

Reaction thermochemistry data

Data compiled by: José A. Martinho Simões

Individual Reactions

C39H66MoO3P3 (solution) + 1,3-Diazine (solution) = C44H71MoNO3P2 (solution)

By formula: C39H66MoO3P3 (solution) + C4H4N2 (solution) = C44H71MoNO3P2 (solution)

Quantity Value Units Method Reference Comment
Δr-70.7 ± 2.5kJ/molRSCZhang, Gonzalez, et al., 1991solvent: Toluene

References

Zhang, Gonzalez, et al., 1991
Zhang, K.; Gonzalez, A.A.; Murkerjee, S.L.; Chou, S.-J.; Hoff, C.D.; Kubat- Martin, K.A.; Barnhart, D.; Kubas, G.J., J. Am. Chem. Soc., 1991, 113, 9170. [all data]