Mo(CO)3

Gas phase thermochemistry data

Data compiled by: José A. Martinho Simões

Quantity Value Units Method Reference Comment
Δfgas-171. ± 33.kJ/molReviewMartinho SimõesThe enthalpy of formation relies on -412. ± 25. kJ/mol for the enthalpy of formation of Mo(CO)4(g)
Δfgas-145. ± 42.kJ/molReviewMartinho SimõesThe enthalpy of formation of relies on -915.3 ± 2.1 kJ/mol for the enthalpy of formation of Mo(CO)6(g)

References

Martinho Simões
Martinho Simões, J.A., Private communication (see http://webbook.nist.gov/chemistry/om/). [all data]