Mo(CO)4

Gas phase thermochemistry data

Data compiled by: José A. Martinho Simões

Quantity Value Units Method Reference Comment
Δfgas-412. ± 25.kJ/molReviewMartinho SimõesThe enthalpy of formation relies on -635. ± 13. kJ/mol for the enthalpy of formation of Mo(CO)5(g)
Δfgas-379. ± 64.kJ/molReviewMartinho SimõesThe enthalpy of formation relies on -635. ± 13. kJ/mol for the enthalpy of formation of Mo(CO)5(g)
Δfgas-401.4kJ/molReviewMartinho SimõesThe enthalpy of formation relies on -635. ± 13. kJ/mol for the enthalpy of formation of Mo(CO)5(g)

Reaction thermochemistry data

Data compiled by: José A. Martinho Simões

Individual Reactions

C5MoO5 (g) = C4MoO4 (g) + Carbon monoxide (g)

By formula: C5MoO5 (g) = C4MoO4 (g) + CO (g)

Quantity Value Units Method Reference Comment
Δr123.4kJ/molKinGRayner, Ishikawa, et al., 1991
Δr113. ± 21.kJ/molKinGGanske and Rosenfeld, 1990
Δr146. ± 63.kJ/molMBPSVenkataraman, Hou, et al., 1990

C4MoO4 (g) = C3MoO3 (g) + Carbon monoxide (g)

By formula: C4MoO4 (g) = C3MoO3 (g) + CO (g)

Quantity Value Units Method Reference Comment
Δr130.kJ/molKinGRayner, Ishikawa, et al., 1991
Δr130. ± 21.kJ/molKinGGanske and Rosenfeld, 1990
Δr126. ± 63.kJ/molMBPSVenkataraman, Hou, et al., 1990

References

Martinho Simões
Martinho Simões, J.A., Private communication (see http://webbook.nist.gov/chemistry/om/). [all data]

Rayner, Ishikawa, et al., 1991
Rayner, D.M.; Ishikawa, Y.; Brown, C.E.; Hackett, P.A., J. Chem. Phys., 1991, 94, 5471. [all data]

Ganske and Rosenfeld, 1990
Ganske, J.A.; Rosenfeld, R.N., J. Phys. Chem., 1990, 94, 4315. [all data]

Venkataraman, Hou, et al., 1990
Venkataraman, B.; Hou, H.; Zhang, Z.; Chen, S.; Bandukwalla, G.; Vernon, M., J. Chem. Phys., 1990, 92, 5338. [all data]