Mo(CO)5(n-C7H16)

Reaction thermochemistry data

Data compiled by: José A. Martinho Simões

Individual Reactions

C12H16MoO5 (solution) = C5MoO5 (solution) + Heptane (solution)

By formula: C12H16MoO5 (solution) = C5MoO5 (solution) + C7H16 (solution)

Quantity Value Units Method Reference Comment
Δr8.70kcal/molN/AMorse, Parker, et al., 1989solvent: Heptane; The reaction enthalpy was derived by using the LPHP value for the enthalpy of cleavage of Mo-CO bond in Mo(CO)6, 40.51 kcal/mol Lewis, Golden, et al., 1984, toghether with a PAC value for the reaction Mo(CO)6(solution) + n-C7H16(solution) = Mo(CO)5(n-C7H16)(solution) + CO(solution), 31.81 kcal/mol Morse, Parker, et al., 1989

Molybdenum hexacarbonyl (solution) + Heptane (solution) = C12H16MoO5 (solution) + Carbon monoxide (solution)

By formula: C6MoO6 (solution) + C7H16 (solution) = C12H16MoO5 (solution) + CO (solution)

Quantity Value Units Method Reference Comment
Δr32.3 ± 2.9kcal/molPACJohnson, Popov, et al., 1991solvent: Heptane; The reaction enthalpy relies on 0.67 for the quantum yield of CO dissociation.
Δr31.8 ± 1.3kcal/molPACMorse, Parker, et al., 1989solvent: Heptane; The reaction enthalpy relies on 0.67 for the quantum yield of CO dissociation

References

Morse, Parker, et al., 1989
Morse, J.M., Jr.; Parker, G.H.; Burkey, T.J., Organometallics, 1989, 8, 2471. [all data]

Lewis, Golden, et al., 1984
Lewis, K.E.; Golden, D.M.; Smith, G.P., Organometallic bond dissociation energies: Laser pyrolysis of Fe(CO)5, Cr(CO)6, Mo(CO)6, and W(CO)6, J. Am. Chem. Soc., 1984, 106, 3905. [all data]

Johnson, Popov, et al., 1991
Johnson, F.P.A.; Popov, V.K.; George, M.W.; Bagratashvili, V.N.; Poliakoff, M.; Turner, J.J., Mendeleev Commun., 1991, 145.. [all data]