Mo(Cp)2(Et)2

Gas phase thermochemistry data

Data compiled by: José A. Martinho Simões

Quantity Value Units Method Reference Comment
Δfgas70.2 ± 1.2kcal/molReviewMartinho SimõesThe enthalpy of formation relies on -23.0 ± 0.69 kcal/mol for the enthalpy of formation of Mo(Cp)2(Cl)2(cr)

References

Martinho Simões
Martinho Simões, J.A., Private communication (see http://webbook.nist.gov/chemistry/om/). [all data]