(Na)[Mo(Cp)(CO)3]

Reaction thermochemistry data

Data compiled by: José A. Martinho Simões

Individual Reactions

0.5C16H10Mo2O6 (solution) + sodium (cr) = C8H5MoNaO3 (solution)

By formula: 0.5C16H10Mo2O6 (solution) + Na (cr) = C8H5MoNaO3 (solution)

Quantity Value Units Method Reference Comment
Δr-63.46 ± 0.86kcal/molRSCKiss, Nolan, et al., 1994solvent: Tetrahydrofuran; The reaction enthalpy was calculated from the enthalpies of the following reactions: 0.5[Mo(Cp)(CO)3]2(solution) + (Na)[Cr(Cp)(CO)2(PPh3)](solution) = (Na)[Mo(Cp)(CO)3](solution) + Cr(Cp)(CO)2(PPh3)(solution), -3.66 ± 0.1 kcal/mol, Cr(Cp)(CO)2(PPh3)(solution) + (Na)(Ph2CO)(solution) = (Na)[Cr(Cp)(CO)2(PPh3)](solution) + Ph2CO(solution), -21.3 ± 0.60 kcal/mol, and Ph2CO(solution) + Na(cr) = (Na)(Ph2CO)(solution), -38.50 ± 0.60 kcal/mol Kiss, Nolan, et al., 1994.

C8H5MoNaO3 (solution) + Iodine (cr) = C8H5IMoO3 (solution) + Sodium iodide (cr)

By formula: C8H5MoNaO3 (solution) + I2 (cr) = C8H5IMoO3 (solution) + INa (cr)

Quantity Value Units Method Reference Comment
Δr-31.8 ± 1.3kcal/molRSCNolan, López de la Vega, et al., 1986solvent: Tetrahydrofuran

C8H5MoNaO3 (solution) + Methane, iodo- (l) = C9H8MoO3 (solution) + Sodium iodide (cr)

By formula: C8H5MoNaO3 (solution) + CH3I (l) = C9H8MoO3 (solution) + INa (cr)

Quantity Value Units Method Reference Comment
Δr-7.70 ± 0.31kcal/molRSCNolan, López de la Vega, et al., 1986solvent: Tetrahydrofuran

References

Kiss, Nolan, et al., 1994
Kiss, G.; Nolan, S.P.; Hoff, C.D., Inorg. Chim. Acta, 1994, 227, 285. [all data]

Nolan, López de la Vega, et al., 1986
Nolan, S.P.; López de la Vega, R.; Hoff, C.D., J. Organometal. Chem., 1986, 315, 187. [all data]