Cr(C6H6)2(Br)

Condensed phase thermochemistry data

Data compiled by: José A. Martinho Simões

Quantity Value Units Method Reference Comment
Δfsolid-3.4 ± 8.6kJ/molReviewMartinho Simões
Quantity Value Units Method Reference Comment
Δcsolid-7004.0 ± 8.4kJ/molCC-SBTel'noi, Rabinovich, et al., 1972Please also see Pedley and Rylance, 1977.

References

Martinho Simões
Martinho Simões, J.A., Private communication (see http://webbook.nist.gov/chemistry/om/). [all data]

Tel'noi, Rabinovich, et al., 1972
Tel'noi, V.I.; Rabinovich, I.B.; Gribov, B.G.; Pashinkin, A.S.; Salamatin, B.A.; Chernova, V.I., Russ. J. Phys. Chem., 1972, 46, 465. [all data]

Pedley and Rylance, 1977
Pedley, J.B.; Rylance, J., Computer Analysed Thermochemical Data: Organic and Organometallic Compounds, University of Sussex, Brigton, 1977. [all data]