Cr(Cp)2(CO)

Reaction thermochemistry data

Data compiled by: José A. Martinho Simões

Individual Reactions

bis(η(5)-Cyclopentadienyl) chromium (solution) + Carbon monoxide (solution) = C11H10CrO (solution)

By formula: C10H10Cr (solution) + CO (solution) = C11H10CrO (solution)

Quantity Value Units Method Reference Comment
Δr-78.7 ± 2.1kJ/molEqSWong and Brintzinger, 1975solvent: Toluene; Temperature range: 280-308 K

References

Wong and Brintzinger, 1975
Wong, K.L.T.; Brintzinger, H.H., J. Am. Chem. Soc., 1975, 97, 5143. [all data]