Cr(CO)3(py)3

Reaction thermochemistry data

Data compiled by: José A. Martinho Simões

Individual Reactions

C9H9CrN3O3 (solution) + 31,3-Diazine (solution) = C18H15CrN3O3 (solution) + 3Acetonitrile (solution)

By formula: C9H9CrN3O3 (solution) + 3C4H4N2 (solution) = C18H15CrN3O3 (solution) + 3C2H3N (solution)

Quantity Value Units Method Reference Comment
Δr-48.1 ± 3.8kJ/molRSCMukerjee, Lang, et al., 1992solvent: Tetrahydrofuran

References

Mukerjee, Lang, et al., 1992
Mukerjee, S.L.; Lang, R.F.; Ju, T.; Kiss, G.; Hoff, C.D.; Nolan, S.P., Inorg. Chem., 1992, 31, 4885. [all data]