Cr(CO)2(C6H6)(n-C7H16)

Reaction thermochemistry data

Data compiled by: José A. Martinho Simões

Individual Reactions

Benzenechromiumtricarbonyl (solution) + Heptane (solution) = C15H22CrO2 (solution) + Carbon monoxide (solution)

By formula: C9H6CrO3 (solution) + C7H16 (solution) = C15H22CrO2 (solution) + CO (solution)

Quantity Value Units Method Reference Comment
Δr137.2 ± 1.3kJ/molPACBurkey, 1990solvent: Heptane; The reaction enthalpy relies on 0.72 for the quantum yield of CO dissociation

References

Burkey, 1990
Burkey, T.J., J. Am. Chem. Soc., 1990, 112, 8329. [all data]