Cr(CO)5(NBu3)

Reaction thermochemistry data

Data compiled by: José A. Martinho Simões

Individual Reactions

C12H16CrO5 (solution) + Tributylamine (solution) = C17H27CrNO5 (solution) + Heptane (solution)

By formula: C12H16CrO5 (solution) + C12H27N (solution) = C17H27CrNO5 (solution) + C7H16 (solution)

Quantity Value Units Method Reference Comment
Δr-12.2 ± 1.2kcal/molPACYang, Peters, et al., 1986solvent: Heptane

References

Yang, Peters, et al., 1986
Yang, G.K.; Peters, K.S.; Vaida, V., Chem. Phys. Lett., 1986, 125, 566. [all data]