Bi(Me)2

Reaction thermochemistry data

Data compiled by: José A. Martinho Simões

Individual Reactions

Bismuthine, trimethyl- (g) = C2H6Bi (g) + Methane (g)

By formula: C3H9Bi (g) = C2H6Bi (g) + CH4 (g)

Quantity Value Units Method Reference Comment
Δr209. - 222.kJ/molN/ASmith and Patrick, 1983
Δr218. ± 17.kJ/molN/AMcMillen and Golden, 1982

Gas phase thermochemistry data

Data compiled by: José A. Martinho Simões

Quantity Value Units Method Reference Comment
Δfgas265. ± 22.kJ/molReviewMartinho SimõesThe enthalpy of formation relies on 194. ± 14. kJ/mol for the enthalpy of formation of Bi(Me)3(g).
Δfgas256. - 269.kJ/molReviewMartinho SimõesThe enthalpy of formation limits rely on 194. ± 14. kJ/mol for the enthalpy of formation of Bi(Me)3(g).

References

Smith and Patrick, 1983
Smith, G.P.; Patrick, R., Int. J. Chem. Kinet., 1983, 15, 167. [all data]

McMillen and Golden, 1982
McMillen, D.F.; Golden, D.M., Hydrocarbon bond dissociation energies, Ann. Rev. Phys. Chem., 1982, 33, 493. [all data]