Sb(Et)2

Gas phase thermochemistry data

Data compiled by: José A. Martinho Simões

Quantity Value Units Method Reference Comment
Δfgas41.2 ± 4.9kcal/molReviewMartinho SimõesThe enthalpy of formation relies on 11.6 ± 2.7 kcal/mol for the enthalpy of formation of Sb(Et)3(g).
Δfgas40.2 ± 4.1kcal/molReviewMartinho SimõesThe enthalpy of formation relies on 11.6 ± 2.7 kcal/mol for the enthalpy of formation of Sb(Et)3(g).

References

Martinho Simões
Martinho Simões, J.A., Private communication (see http://webbook.nist.gov/chemistry/om/). [all data]