Sn(Me)3(OOCPh)

Condensed phase thermochemistry data

Data compiled by: José A. Martinho Simões

Quantity Value Units Method Reference Comment
Δfsolid-488.5 ± 8.5kJ/molReviewMartinho Simões
Quantity Value Units Method Reference Comment
Δcsolid-6025.0 ± 8.4kJ/molCC-SBTel'noi and Rabinovich, 1966Please also see Pedley and Rylance, 1977 and Cox and Pilcher, 1970.

References

Martinho Simões
Martinho Simões, J.A., Private communication (see http://webbook.nist.gov/chemistry/om/). [all data]

Tel'noi and Rabinovich, 1966
Tel'noi, V.I.; Rabinovich, I.B., Russ. J. Phys. Chem., 1966, 40, 842. [all data]

Pedley and Rylance, 1977
Pedley, J.B.; Rylance, J., Computer Analysed Thermochemical Data: Organic and Organometallic Compounds, University of Sussex, Brigton, 1977. [all data]

Cox and Pilcher, 1970
Cox, J.D.; Pilcher, G., Thermochemistry of Organic and Organometallic Compounds in Academic Press, New York, 1970. [all data]