Sn(Et)3

Gas phase thermochemistry data

Data compiled by: José A. Martinho Simões

Quantity Value Units Method Reference Comment
Δfgas103. ± 17.kJ/molReviewMartinho SimõesThe enthalpy of formation relies on -42.0 ± 2.6 kJ/mol for the enthalpy of formation of Sn(Et)4(g).
Δfgas94. - 107.kJ/molReviewMartinho SimõesThe enthalpy of formation limits rely on -42.0 ± 2.6 kJ/mol for the enthalpy of formation of Sn(Et)4(g).

References

Martinho Simões
Martinho Simões, J.A., Private communication (see http://webbook.nist.gov/chemistry/om/). [all data]