Ga(Et)2

Gas phase thermochemistry data

Data compiled by: José A. Martinho Simões

Quantity Value Units Method Reference Comment
Δfgas28. ± 20.kJ/molReviewMartinho SimõesThe enthalpy of formation relies on -62. ± 10. kJ/mol for the enthalpy of formation of Ga(Et)3(g).
Δfgas19.7kJ/molReviewMartinho SimõesThe enthalpy of formation relies on -62. ± 10. kJ/mol for the enthalpy of formation of Ga(Et)3(g).

References

Martinho Simões
Martinho Simões, J.A., Private communication (see http://webbook.nist.gov/chemistry/om/). [all data]