Al(O-t-Bu)(Et)2

Condensed phase thermochemistry data

Data compiled by: José A. Martinho Simões

Quantity Value Units Method Reference Comment
Δfliquid-774. ± 17.kJ/molReviewMartinho Simões
Quantity Value Units Method Reference Comment
Δcliquid-5928. ± 17.kJ/molCC-SBShmyreva, Golosova, et al., 1974Please also see Pedley and Rylance, 1977.

References

Martinho Simões
Martinho Simões, J.A., Private communication (see http://webbook.nist.gov/chemistry/om/). [all data]

Shmyreva, Golosova, et al., 1974
Shmyreva, G.O.; Golosova, R.M.; Sakharovskaya, G.B.; Popov, A.F.; Korneev, N.N.; Smolyaninova, A.A., Russ. J. Phys. Chem., 1974, 48, 447. [all data]

Pedley and Rylance, 1977
Pedley, J.B.; Rylance, J., Computer Analysed Thermochemical Data: Organic and Organometallic Compounds, University of Sussex, Brigton, 1977. [all data]