Al(Pr)2(H)

Condensed phase thermochemistry data

Data compiled by: José A. Martinho Simões

Quantity Value Units Method Reference Comment
Δfliquid-243.1 ± 3.5kJ/molReviewMartinho Simões
Quantity Value Units Method Reference Comment
Δcliquid-5099.5 ± 3.3kJ/molCC-SBPawlenko, 1967Please also see Pedley and Rylance, 1977 and Cox and Pilcher, 1970.

References

Martinho Simões
Martinho Simões, J.A., Private communication (see http://webbook.nist.gov/chemistry/om/). [all data]

Pawlenko, 1967
Pawlenko, S., Chem. Ber., 1967, 100, 3591. [all data]

Pedley and Rylance, 1977
Pedley, J.B.; Rylance, J., Computer Analysed Thermochemical Data: Organic and Organometallic Compounds, University of Sussex, Brigton, 1977. [all data]

Cox and Pilcher, 1970
Cox, J.D.; Pilcher, G., Thermochemistry of Organic and Organometallic Compounds in Academic Press, New York, 1970. [all data]