Al(Bu)3

Condensed phase thermochemistry data

Data compiled by: José A. Martinho Simões

Quantity Value Units Method Reference Comment
Δfliquid-89.03 ± 0.53kcal/molReviewMartinho SimõesLiquid tributylaluminum contains a very small molar fraction of monomer at 298 K, ca. 0.8% Smith, 1974, so that the "real" liquid should be described as [Al(Bu)3]2.
Quantity Value Units Method Reference Comment
Δcliquid-2162.1 ± 0.31kcal/molCC-SBPawlenko, 1967Please also see Pedley and Rylance, 1977 and Cox and Pilcher, 1970.

Reaction thermochemistry data

Data compiled by: José A. Martinho Simões

Individual Reactions

C24H54Al2 (l) = 2C12H27Al (l)

By formula: C24H54Al2 (l) = 2C12H27Al (l)

Quantity Value Units Method Reference Comment
Δr15.0 ± 0.1kcal/molEqSSmith, 1974

References

Martinho Simões
Martinho Simões, J.A., Private communication (see http://webbook.nist.gov/chemistry/om/). [all data]

Smith, 1974
Smith, M.B., J. Organometal. Chem., 1974, 70, 13. [all data]

Pawlenko, 1967
Pawlenko, S., Chem. Ber., 1967, 100, 3591. [all data]

Pedley and Rylance, 1977
Pedley, J.B.; Rylance, J., Computer Analysed Thermochemical Data: Organic and Organometallic Compounds, University of Sussex, Brigton, 1977. [all data]

Cox and Pilcher, 1970
Cox, J.D.; Pilcher, G., Thermochemistry of Organic and Organometallic Compounds in Academic Press, New York, 1970. [all data]