Hg(Et)(OOCMe2Ph)

Condensed phase thermochemistry data

Data compiled by: José A. Martinho Simões

Quantity Value Units Method Reference Comment
Δfsolid-18.0 ± 2.0kcal/molRSCTel'noi and Rabinovich, 1980Value corrected based on a set of ancillary data by J.A. Martinho Simões; The enthalpy of formation was quoted from Tel'noi and Rabinovich, 1980 and relies on experimental data in Kupriyanov, Alyasov, et al., 1974.

References

Tel'noi and Rabinovich, 1980
Tel'noi, V.I.; Rabinovich, I.B., Russ. Chem. Rev., 1980, 49, 603. [all data]

Kupriyanov, Alyasov, et al., 1974
Kupriyanov, V.F.; Alyasov, V.N.; Tsvetkov, V.G.; Sheiman, M.S.; Buzulukov, V.I.; Maslennikov, V.P.; Aleksandrov, Yu.A., Trudy Khim. Khim. Tekhnol., Gorky, 1974, 80.. [all data]