Zn(t-Bu)2

Phase change data

Data compiled by: José A. Martinho Simões

Quantity Value Units Method Reference Comment
Δsub94.6 ± 2.0kJ/molN/ASokolovskii and Baev, 1984

References

Sokolovskii and Baev, 1984
Sokolovskii, A.E.; Baev, A.K., Russ. J. Phys. Chem., 1984, 58, 1635. [all data]