cis-Pt(PPh3)2(SEt)2

Phase change data

Data compiled by: José A. Martinho Simões

Quantity Value Units Method Reference Comment
Δsub295. ± 20.kJ/molTD-HFCAl Takhin, Skinner, et al., 1984

References

Al Takhin, Skinner, et al., 1984
Al Takhin, G.; Skinner, H.A.; Zaki, A.A., J. Chem. Soc., Dalton Trans., 1984, 371.. [all data]