Pt(PPh3)2(bcpd)

Phase change data

Data compiled by: José A. Martinho Simões

Quantity Value Units Method Reference Comment
Δsub262. ± 20.kJ/molN/AMortimer, 1984

References

Mortimer, 1984
Mortimer, C.T., Rev. Inorg. Chem., 1984, 6, 233. [all data]