Pt(PPh3)2(Cl)(CPhCHPh)

Condensed phase thermochemistry data

Data compiled by: José A. Martinho Simões

Quantity Value Units Method Reference Comment
Δfsolid571. ± 21.kJ/molReviewMartinho SimõesThe enthalpy of formation relies on 754. ± 20. kJ/mol for the enthalpy of formation of Pt(PPh3)2(C2Ph2)(cr).

References

Martinho Simões
Martinho Simões, J.A., Private communication (see http://webbook.nist.gov/chemistry/om/). [all data]