trans-Pt[P(i-Pr)3]2(Cl)2

Gas phase thermochemistry data

Data compiled by: José A. Martinho Simões

Quantity Value Units Method Reference Comment
Δfgas-592. ± 22.kJ/molReviewMartinho Simões

Condensed phase thermochemistry data

Data compiled by: José A. Martinho Simões

Quantity Value Units Method Reference Comment
Δfsolid-785. ± 21.kJ/molReviewMartinho Simões

Phase change data

Data compiled by: José A. Martinho Simões

Quantity Value Units Method Reference Comment
Δsub193. ± 4.kJ/molTD-HFCAl Takhin, Skinner, et al., 1984

References

Martinho Simões
Martinho Simões, J.A., Private communication (see http://webbook.nist.gov/chemistry/om/). [all data]

Al Takhin, Skinner, et al., 1984
Al Takhin, G.; Skinner, H.A.; Zaki, A.A., J. Chem. Soc., Dalton Trans., 1984, 371.. [all data]