cis-Pt(PEt3)2(SEt2)2

Phase change data

Data compiled by: José A. Martinho Simões

Quantity Value Units Method Reference Comment
Δsub196. ± 11.kJ/molTD-HFCAl Takhin, Skinner, et al., 1984

References

Al Takhin, Skinner, et al., 1984
Al Takhin, G.; Skinner, H.A.; Zaki, A.A., J. Chem. Soc., Dalton Trans., 1984, 371.. [all data]