Pt(dppe)(Me)(NPh2)

Reaction thermochemistry data

Data compiled by: José A. Martinho Simões

Individual Reactions

C27H28OP2Pt (solution) + C28H43NP2Ru (solution) = C39H37NP2Pt (solution) + C16H34OP2Ru (solution)

By formula: C27H28OP2Pt (solution) + C28H43NP2Ru (solution) = C39H37NP2Pt (solution) + C16H34OP2Ru (solution)

Quantity Value Units Method Reference Comment
Δr-3.61kcal/molEqSBryndza, Fong, et al., 1987solvent: Tetrahydrofuran; The reaction enthalpy can be identified with the reaction Gibbs energy, since the the entropy is expected to be small Bryndza, Fong, et al., 1987

References

Bryndza, Fong, et al., 1987
Bryndza, H.E.; Fong, L.K.; Paciello, R.A.; Tam, W.; Bercaw, J.E., J. Am. Chem. Soc., 1987, 109, 1444. [all data]