NiFe(CO)9

Reaction thermochemistry data

Data compiled by: José A. Martinho Simões

Individual Reactions

C9FeNiO9 (g) = Nickel tetracarbonyl (g) + Iron pentacarbonyl (g)

By formula: C9FeNiO9 (g) = C4NiO4 (g) + C5FeO5 (g)

Quantity Value Units Method Reference Comment
Δr37.7kJ/molEqGBaev and Fedulova, 1983Temperature range: 293-313 K

References

Baev and Fedulova, 1983
Baev, A.K.; Fedulova, L.G., Russ. J. Phys. Chem., 1983, 57, 1159. [all data]