Nb(Cp)2(I)2

Reaction thermochemistry data

Data compiled by: José A. Martinho Simões

Individual Reactions

C12H16Nb (cr) + 2Iodine (cr) = C10H10I2Nb (cr) + 2Methane, iodo- (l)

By formula: C12H16Nb (cr) + 2I2 (cr) = C10H10I2Nb (cr) + 2CH3I (l)

Quantity Value Units Method Reference Comment
Δr-57.91 ± 0.57kcal/molRSCDiogo, Simoni, et al., 1993The difference between the enthalpies of formation of Nb(Cp)2(I)2 and Nb(Cp)2(Me)2 is calculated as -51.41 ± 0.62 kcal/mol

References

Diogo, Simoni, et al., 1993
Diogo, H.P.; Simoni, J.A.; Minas da Piedade, M.E.; Dias, A.R.; Martinho Simões, J.A., J. Am. Chem. Soc., 1993, 115, 2764. [all data]