V(O-t-Bu)4

Phase change data

Data compiled by: José A. Martinho Simões

Quantity Value Units Method Reference Comment
Δvap15.8 ± 0.79kcal/molRSCBradley and Hillyer, 1966

References

Bradley and Hillyer, 1966
Bradley, D.C.; Hillyer, M.J., Trans. Faraday Soc., 1966, 62, 2382. [all data]