Hf(O-i-Pr)4

Phase change data

Data compiled by: José A. Martinho Simões

Quantity Value Units Method Reference Comment
Δsub20.0 ± 2.0kcal/molRSCLappert, Patil, et al., 1975

References

Lappert, Patil, et al., 1975
Lappert, M.F.; Patil, D.S.; Pedley, J.B., J. Chem. Soc., Chem. Commun., 1975, 830.. [all data]