Zr(Cp)2(Cl)(OPh)

Condensed phase thermochemistry data

Data compiled by: José A. Martinho Simões

Quantity Value Units Method Reference Comment
Δfsolid-557.6 ± 5.8kJ/molReviewMartinho SimõesThe enthalpy of formation relies on -314.8 ± 3.9 kJ/mol for the enthalpy of formation of Zr(Cp)2(Cl)(H)(cr)

Reaction thermochemistry data

Data compiled by: José A. Martinho Simões

Individual Reactions

Phenol (cr) + C10H11ClZr (cr) = C16H15ClOZr (cr) + Hydrogen (g)

By formula: C6H6O (cr) + C10H11ClZr (cr) = C16H15ClOZr (cr) + H2 (g)

Quantity Value Units Method Reference Comment
Δr-77.7 ± 4.2kJ/molRSCDiogo, Simoni, et al., 1993

References

Martinho Simões
Martinho Simões, J.A., Private communication (see http://webbook.nist.gov/chemistry/om/). [all data]

Diogo, Simoni, et al., 1993
Diogo, H.P.; Simoni, J.A.; Minas da Piedade, M.E.; Dias, A.R.; Martinho Simões, J.A., J. Am. Chem. Soc., 1993, 115, 2764. [all data]