Zr(Cp)2(Cl)(O-t-Bu)

Condensed phase thermochemistry data

Data compiled by: José A. Martinho Simões

Quantity Value Units Method Reference Comment
Δfsolid-177.1 ± 1.1kcal/molReviewMartinho SimõesThe enthalpy of formation relies on -75.24 ± 0.93 kcal/mol for the enthalpy of formation of Zr(Cp)2(Cl)(H)(cr)

References

Martinho Simões
Martinho Simões, J.A., Private communication (see http://webbook.nist.gov/chemistry/om/). [all data]