Zr(Cp)2(Cl)(He)

Reaction thermochemistry data

Data compiled by: José A. Martinho Simões

Individual Reactions

C10H11ClZr (cr) + 1-Hexene (l) = C16H23ClZr (cr)

By formula: C10H11ClZr (cr) + C6H12 (l) = C16H23ClZr (cr)

Quantity Value Units Method Reference Comment
Δr-15.3 ± 0.98kcal/molRSCDiogo, Simoni, et al., 1993

References

Diogo, Simoni, et al., 1993
Diogo, H.P.; Simoni, J.A.; Minas da Piedade, M.E.; Dias, A.R.; Martinho Simões, J.A., J. Am. Chem. Soc., 1993, 115, 2764. [all data]