Zr(Cp*)2(OPh)(H)

Reaction thermochemistry data

Data compiled by: José A. Martinho Simões

Individual Reactions

C20H32Zr (solution) + Phenol (solution) = C26H36OZr (solution) + Hydrogen (g)

By formula: C20H32Zr (solution) + C6H6O (solution) = C26H36OZr (solution) + H2 (g)

Quantity Value Units Method Reference Comment
Δr-132.6 ± 1.7kJ/molRSCSchock and Marks, 1988solvent: Toluene

C26H36OZr (solution) + Phenol (solution) = C32H40O2Zr (solution) + Hydrogen (g)

By formula: C26H36OZr (solution) + C6H6O (solution) = C32H40O2Zr (solution) + H2 (g)

Quantity Value Units Method Reference Comment
Δr-86.6 ± 2.9kJ/molRSCSchock and Marks, 1988solvent: Toluene

References

Schock and Marks, 1988
Schock, L.E.; Marks, T.J., J. Am. Chem. Soc., 1988, 110, 7701. [all data]