Zr(Cp*)(Me)3

Reaction thermochemistry data

Data compiled by: José A. Martinho Simões

Individual Reactions

C13H24Zr (solution) + Phenol, pentafluoro- (solution) = C18H21F5OZr (solution) + Methane (g)

By formula: C13H24Zr (solution) + C6HF5O (solution) = C18H21F5OZr (solution) + CH4 (g)

Quantity Value Units Method Reference Comment
Δr-44.91 ± 0.50kcal/molRSCSchock and Marks, 1988solvent: Toluene

References

Schock and Marks, 1988
Schock, L.E.; Marks, T.J., J. Am. Chem. Soc., 1988, 110, 7701. [all data]