Zr(Cp*)2(CO)2

Reaction thermochemistry data

Data compiled by: José A. Martinho Simões

Individual Reactions

C22H30O2Zr (solution) + Iodine (solution) = C20H30I2Zr (solution) + 2Carbon monoxide (solution)

By formula: C22H30O2Zr (solution) + I2 (solution) = C20H30I2Zr (solution) + 2CO (solution)

Quantity Value Units Method Reference Comment
Δr-45.79 ± 0.41kcal/molRSCSchock and Marks, 1988solvent: Toluene

References

Schock and Marks, 1988
Schock, L.E.; Marks, T.J., J. Am. Chem. Soc., 1988, 110, 7701. [all data]