Ti(Cp)2(Bz)2

Gas phase thermochemistry data

Data compiled by: José A. Martinho Simões

Quantity Value Units Method Reference Comment
Δfgas279. ± 10.kJ/molReviewMartinho Simões

Condensed phase thermochemistry data

Data compiled by: José A. Martinho Simões

Quantity Value Units Method Reference Comment
Δfsolid195.3 ± 6.0kJ/molReviewMartinho Simões
Quantity Value Units Method Reference Comment
Δcsolid-14013.5 ± 5.0kJ/molCC-SBTel'noi and Rabinovich, 1977

References

Martinho Simões
Martinho Simões, J.A., Private communication (see http://webbook.nist.gov/chemistry/om/). [all data]

Tel'noi and Rabinovich, 1977
Tel'noi, V.I.; Rabinovich, I.B., Russ. Chem. Rev., 1977, 46, 689. [all data]