U(Me3SiCp)3(CO)

Reaction thermochemistry data

Data compiled by: José A. Martinho Simões

Individual Reactions

C24H39Si3U (solution) + Carbon monoxide (solution) = C25H39OSi3U (solution)

By formula: C24H39Si3U (solution) + CO (solution) = C25H39OSi3U (solution)

Quantity Value Units Method Reference Comment
Δr-10.3 ± 0.2kcal/molRSCSchock, Seyam, et al., 1988solvent: Toluene

References

Schock, Seyam, et al., 1988
Schock, L.E.; Seyam, A.M.; Sabat, M.; Marks, T.J., Polyhedron, 1988, 7, 1517. [all data]