U(cotBu)2

Gas phase thermochemistry data

Data compiled by: José A. Martinho Simões

Quantity Value Units Method Reference Comment
Δfgas115. ± 21.kJ/molReviewMartinho Simões

Condensed phase thermochemistry data

Data compiled by: José A. Martinho Simões

Quantity Value Units Method Reference Comment
Δfsolid-32. ± 21.kJ/molReviewMartinho Simões
Quantity Value Units Method Reference Comment
Δcsolid-15177. ± 21.kJ/molCC-SBKuznetsov, Mitin, et al., 1987

Phase change data

Data compiled by: José A. Martinho Simões

Quantity Value Units Method Reference Comment
Δsub147.kJ/molCC-SBKuznetsov, Mitin, et al., 1987

References

Martinho Simões
Martinho Simões, J.A., Private communication (see http://webbook.nist.gov/chemistry/om/). [all data]

Kuznetsov, Mitin, et al., 1987
Kuznetsov, N.T.; Mitin, V.A.; Kir'yanov, K.V.; Sevast'yanov, V.G.; Bogdanov, V.A., Radiokhimiya, 1987, 29, 109. [all data]