Th(Cp*)2[O-2,6-(t-Bu)2C6H3](H)

Reaction thermochemistry data

Data compiled by: José A. Martinho Simões

Individual Reactions

C34H52OTh (solution) + Carbon monoxide (solution) = C35H52O2Th (solution)

By formula: C34H52OTh (solution) + CO (solution) = C35H52O2Th (solution)

Quantity Value Units Method Reference Comment
Δr-24.7 ± 6.3kJ/molEqSMoloy and Marks, 1984solvent: Toluene; Temperature range: ca. 180-200 K

References

Moloy and Marks, 1984
Moloy, K.G.; Marks, T.J., J. Am. Chem. Soc., 1984, 106, 7051. [all data]