Th(Cp*)2[OCH(t-Bu)2](H)

Reaction thermochemistry data

Data compiled by: José A. Martinho Simões

Individual Reactions

C29H50OTh (solution) + Carbon monoxide (solution) = C30H50O2Th (solution)

By formula: C29H50OTh (solution) + CO (solution) = C30H50O2Th (solution)

Quantity Value Units Method Reference Comment
Δr-18.8 ± 3.8kJ/molEqSMoloy and Marks, 1984solvent: Toluene; Temperature range: ca. 180-220 K

References

Moloy and Marks, 1984
Moloy, K.G.; Marks, T.J., J. Am. Chem. Soc., 1984, 106, 7051. [all data]