Mg(Br)(Bz)

Reaction thermochemistry data

Data compiled by: José A. Martinho Simões

Individual Reactions

Benzene, (bromomethyl)- (l) + magnesium (cr) = C7H7BrMg (solution)

By formula: C7H7Br (l) + Mg (cr) = C7H7BrMg (solution)

Quantity Value Units Method Reference Comment
Δr-65.9 ± 1.1kcal/molRSCHolm, 1981solvent: Diethyl ether; Due to the possibility of side reactions, the enthalpy of reaction was not considered to be sufficiently reliable for deriving the enthalpy of formation of the Grignard reagent Holm, 1981

References

Holm, 1981
Holm, T., J. Chem. Soc., Perkin Trans. II, 1981, 464.. [all data]