Mg(Br)(1-EtPr)

Reaction thermochemistry data

Data compiled by: José A. Martinho Simões

Individual Reactions

C5H11BrMg (solution) + Hydrogen bromide (g) = Pentane (solution) + Br2Mg (solution)

By formula: C5H11BrMg (solution) + HBr (g) = C5H12 (solution) + Br2Mg (solution)

Quantity Value Units Method Reference Comment
Δr-73.21 ± 0.53kcal/molRSCHolm, 1981solvent: Diethyl ether

References

Holm, 1981
Holm, T., J. Chem. Soc., Perkin Trans. II, 1981, 464.. [all data]