Mg(Cl)(Bu)

Condensed phase thermochemistry data

Data compiled by: José A. Martinho Simões

Quantity Value Units Method Reference Comment
Δfsolid-455.7 ± 2.0kJ/molReviewMartinho Simões

Reaction thermochemistry data

Data compiled by: José A. Martinho Simões

Individual Reactions

C4H9ClMg (cr) + (Hydrogen chloride • 556Water) (solution) = Butane (g) + (Cl2Mg • 900Water) (solution)

By formula: C4H9ClMg (cr) + (HCl • 556H2O) (solution) = C4H10 (g) + (Cl2Mg • 900H2O) (solution)

Quantity Value Units Method Reference Comment
Δr-305.8 ± 1.8kJ/molRSCGenchel, Evstigneeva, et al., 1976

References

Martinho Simões
Martinho Simões, J.A., Private communication (see http://webbook.nist.gov/chemistry/om/). [all data]

Genchel, Evstigneeva, et al., 1976
Genchel, V.G.; Evstigneeva, E.V.; Petrova, N.V., Zh. Fiz. Khim., 1976, 50, 1909. [all data]